E39 Actor
type: Class
color: #56B4E9
notation: E39
preferred label: Author
related: F2 Expression

E56 Language
type: Class
color: #56B4E9
notation: E56
preferred label: Language
related: F2 Expression

died in
domain: E21 Person
range: E69 Death
inverse of: was death of

is title of
domain: E35 Title
range: F2 Expression
inverse of: has title

is carried by
domain: E89 Propositional Object
range: F5 Item
inverse of: carries

is subject of
domain: F2 Expression
range: REO40 Subject matter
inverse of: is about

performed
domain: E21 Person
range: E7 Activity
inverse of: carried out by

influenced
domain: E89 Propositional Object
range: E7 Activity
inverse of: was influenced by

is time-span of
domain: E52 Time-Span
range: E7 Activity
inverse of: has time-span

forms part of
domain: REO13 Position
domain: REO3 Environment
domain: REO8 Lighting
domain: REO9 Location
range: REO1 Circumstances
inverse of: consists of

is referred to by
domain: F2 Expression
range: E89 Propositional Object
inverse of: refers to

identifies
domain: E50 Date
range: E52 Time-Span
inverse of: is identified by

witnessed
domain: E53 Place
range: E7 Activity
inverse of: took place at

identifies
domain: E48 Place Name
range: E53 Place
inverse of: is identified by

was born
domain: E21 Person
range: E67 Birth
inverse of: brought into life

READ-IT ongoing
type: Ontology
imports: cidoc-crm
version info: Exported from OntoME: READ-IT ongoing

readP21i has age
type: ObjectProperty
domain: E21 Person
range: REO35 Age (temporal entity)
inverse of: readP21 is age of
notation: readP21i
preferred label: has age

readP15i has aim
type: ObjectProperty
domain: REO2 Disposition
range: REO18 Aim
inverse of: readP15 is aim of
notation: readP15i
preferred label: has aim

readP22i has citizenship
type: ObjectProperty
domain: E21 Person
range: REO36 Citizenship
inverse of: readP22 is citizenship of
notation: readP22i
preferred label: has citizenship

readP11i has disposition
type: ObjectProperty
domain: E21 Person
range: REO2 Disposition
inverse of: readP11 is disposition of
notation: readP11i
preferred label: has disposition

readP23i has educational level
type: ObjectProperty
domain: E21 Person
range: REO39 Educational level
inverse of: readP23 is educational level of
notation: readP23i
preferred label: has educational level

readP8i has frequency
type: ObjectProperty
domain: E7 Activity
range: REO4 Frequency
inverse of: readP8 is frequency of
notation: readP8i
preferred label: has frequency

readP5i has genre
type: ObjectProperty
domain: F2 Expression
range: REO6 Genre
inverse of: readP5 is genre of
notation: readP5i
preferred label: has genre

readP12i has habit
type: ObjectProperty
domain: REO2 Disposition
range: REO17 Habit
inverse of: readP12 is habit of
notation: readP12i
preferred label: has habit

readP9i has intensity
type: ObjectProperty
domain: E7 Activity
range: REO7 Intensity
inverse of: readP9 is intensity of
notation: readP9i
preferred label: has intensity

readP26i has medium
type: ObjectProperty
domain: F5 Item
range: REO41 Medium
inverse of: readP26 is medium of
notation: readP26i
preferred label: has medium

readP25i has member (ethnic communities)
type: ObjectProperty
domain: RE038 Ethnic communities
range: E21 Person
inverse of: readP25 is member of (ethnic communities)
notation: readP25i
preferred label: has member (ethnic communities)

readP24i has member (linguisitic communities)
type: ObjectProperty
domain: REO37 Linguistic communities
range: E21 Person
inverse of: readP24 is member of (linguistic communities)
notation: readP24i
preferred label: has member (linguistic communities)

readP2i has nationality
type: ObjectProperty
domain: E21 Person
range: REO10 Nationality
inverse of: readP2 is nationality of
notation: readP2i
preferred label: has nationality

readP17i has effect type
type: ObjectProperty
domain: REO23 Effects (internal processes)
range: REO20 Understanding
range: REO21 Emotions
range: REO27 Mental imagery
range: REO28 Memories (textual)
range: REO29 Memories (non textual)
range: REO30 Expectations
inverse of: readP17 is effect type of
notation: readP17i
preferred label: has effect type

readP10i has outcome type
type: ObjectProperty
domain: REO12_Outcomes (external processes)
range: REO12_Outcomes (external processes)
range: REO22 Evaluation
range: REO26 Summary
range: REO31 Action
range: REO32 Change in thinking
range: REO33 Output
inverse of: readP10 is outcome type of
notation: readP10i
preferred label: has outcome type

readP6i has provenance
type: ObjectProperty
domain: F5 Item
range: REO14 Provenance
inverse of: readP6 is provenance of
notation: readP6i
preferred label: has provenance

readP4i has religion
type: ObjectProperty
domain: E21 Person
range: REO15 Religion (temporal entity)
inverse of: readP4 is religion of
notation: readP4i
preferred label: has religion

readP13i has skill
type: ObjectProperty
domain: E21 Person
range: REO19 Skill
inverse of: readP13 is skill of
notation: readP13i
preferred label: has reading ability

readP7i has status
type: ObjectProperty
domain: F2 Expression
range: REO16 Status
inverse of: readP7 is status of
notation: readP7i
preferred label: has status

readP55 is context of
type: ObjectProperty
domain: REO1 Circumstances
range: E7 Activity
inverse of: readP55i has context
notation: readP55
preferred label: is context of

readP3i is gender of
type: ObjectProperty
domain: REO5 Gender
range: E21 Person
inverse of: readP3 has gender
notation: readP3i
preferred label: is gender of

readP1i is occupation of
type: ObjectProperty
domain: REO11 Occupation
range: E21 Person
inverse of: readP1 has occupation
notation: readP1i
preferred label: is occupation of

readP30i is story element of
type: ObjectProperty
domain: F2 Expression
range: REO44 RA vocabularies
range: REO45 Discovery
inverse of: readP30 has story element
notation: readP30
preferred label: has story element

readP27 is triggered by (effects)
type: ObjectProperty
domain: REO23 Effects (internal processes)
range: E7 Activity
inverse of: readP27i triggers (effects)
notation: readP27
preferred label: is triggered by (effects)

readP28 is triggered by (outcomes)
type: ObjectProperty
domain: REO12_Outcomes (external processes)
range: E7 Activity
inverse of: readP28i triggers (outcomes)
notation: readP28
preferred label: is triggered by (outcomes)

readP29i has appellation
type: ObjectProperty
domain: E21 Person
range: REO43 Appellation (temporal entity)
inverse of: readP29 is appellation of
notation: readP29i
preferred label: has name

was death of
domain: E69 Death
range: E21 Person

has title
domain: F2 Expression
range: E35 Title

carries
domain: F5 Item
range: E89 Propositional Object

is about
domain: REO40 Subject matter
range: F2 Expression

carried out by
domain: E7 Activity
range: E21 Person

was influenced by
domain: E7 Activity
range: E89 Propositional Object

has time-span
domain: E7 Activity
range: E52 Time-Span

consists of
domain: REO1 Circumstances
range: REO13 Position
range: REO3 Environment
range: REO8 Lighting
range: REO9 Location

refers to
domain: F2 Expression
range: E89 Propositional Object

is identified by
domain: E52 Time-Span
range: E50 Date

took place at
domain: E7 Activity
range: E53 Place

is identified by
domain: E53 Place
range: E48 Place Name

brought into life
domain: E67 Birth
range: E21 Person

REO30 Expectations
type: Class
color: #CC79A7
comment: The expectation of what F2 Expression might be like, before the actual E7 Activity has taken place. This includes anticipation.
notation: REO30
preferred label: Expectations
related: REO23 Effects (internal processes)

readP1 has occupation
type: ObjectProperty
domain: E21 Person
range: REO11 Occupation
notation: readP1
preferred label: has occupation

readP10 is outcome type of
type: ObjectProperty
domain: REO22 Evaluation
domain: REO26 Summary
domain: REO31 Action
domain: REO32 Change in thinking
domain: REO33 Output
range: REO12_Outcomes (external processes)
notation: readP10
preferred label: is outcome type of

readP11 is disposition of
type: ObjectProperty
domain: REO2 Disposition
range: E21 Person
notation: readP11
preferred label: is disposition of

readP12 is habit of
type: ObjectProperty
domain: REO17 Habit
range: REO2 Disposition
notation: readP12
preferred label: is habit of

readP13 is skill of
type: ObjectProperty
domain: REO19 Skill
range: E21 Person
notation: readP13
preferred label: is reading ability of

readP15 is aim of
type: ObjectProperty
domain: REO18 Aim
range: REO2 Disposition
notation: readP15
preferred label: is aim of

readP17 is effect type of
type: ObjectProperty
domain: REO20 Understanding
domain: REO21 Emotions
domain: REO23 Effects (internal processes)
domain: REO27 Mental imagery
domain: REO28 Memories (textual)
domain: REO29 Memories (non textual)
range: REO23 Effects (internal processes)
notation: readP17
preferred label: is effect type of

readP2 is nationality of
type: ObjectProperty
domain: REO10 Nationality
range: E21 Person
notation: readP2
preferred label: is nationality of

readP21 is age of
type: ObjectProperty
domain: REO35 Age (temporal entity)
range: E21 Person
notation: readP21
preferred label: is age of

readP22 is citizenship of
type: ObjectProperty
domain: REO36 Citizenship
range: E21 Person
notation: readP22
preferred label: is citizenship of

readP23 is educational level of
type: ObjectProperty
domain: REO39 Educational level
range: E21 Person
notation: readP23
preferred label: is educational level of

readP24 is member of (linguistic communities)
type: ObjectProperty
domain: E21 Person
range: REO37 Linguistic communities
notation: readP24
preferred label: is member of (linguistic communities)

readP25 is member of (ethnic communities)
type: ObjectProperty
domain: E21 Person
range: RE038 Ethnic communities
notation: readP25
preferred label: is member of (ethnic communities)

readP26 is medium of
type: ObjectProperty
domain: REO41 Medium
range: F5 Item
notation: readP26
preferred label: is medium of

readP29 is appellation of
type: ObjectProperty
domain: REO43 Appellation (temporal entity)
range: E21 Person
notation: readP29
preferred label: is name of

readP3 has gender
type: ObjectProperty
domain: E21 Person
range: REO5 Gender
notation: readP3
preferred label: has gender

readP30 has story element
type: ObjectProperty
domain: F2 Expression
range: REO44 RA vocabularies
range: REO45 Discovery
notation: readP30i
preferred label: is story element of

readP4 is religion of
type: ObjectProperty
domain: REO15 Religion (temporal entity)
range: E21 Person
notation: readP4
preferred label: is religion of

readP5 is genre of
type: ObjectProperty
domain: REO6 Genre
range: F2 Expression
notation: readP5
preferred label: is genre of

readP55i has context
type: ObjectProperty
domain: E7 Activity
range: REO1 Circumstances
notation: readP55i
preferred label: has context

readP6 is provenance of
type: ObjectProperty
domain: REO14 Provenance
range: F5 Item
notation: readP6
preferred label: is provenance of

readP7 is status of
type: ObjectProperty
domain: REO16 Status
range: F2 Expression
notation: readP7
preferred label: is status of

readP8 is frequency of
type: ObjectProperty
domain: REO4 Frequency
range: E7 Activity
notation: readP8
preferred label: is frequency of

readP9 is intensity of
type: ObjectProperty
domain: REO7 Intensity
range: E7 Activity
notation: readP9
preferred label: is intensity of

readP27i triggers (effects)
type: ObjectProperty
domain: E7 Activity
range: REO23 Effects (internal processes)
notation: readP27i
preferred label: triggers (effects)

readP28i triggers (outcomes)
type: ObjectProperty
domain: E7 Activity
range: REO12_Outcomes (external processes)
notation: readP28i
preferred label: triggers (outcomes)

E35 Title
type: Class
color: #56B4E9
notation: E35
preferred label: Title
related: F2 Expression

E67 Birth
type: Class
color: #009E73
notation: E67
preferred label: Date of Birth
related: E21 Person

E69 Death
type: Class
color: #009E73
notation: E69
preferred label: Date of Death
related: E21 Person

E50 Date
type: Class
color: #E69F00
notation: E50
preferred label: Date
related: E7 Activity

REO10 Nationality
type: Class
color: #009E73
comment: This class comprises concepts denoted by terms from thesauri and controlled vocabularies used to characterize and classify the nationality of E21 Person at the moment of E7 Activity or at a given time. It is considered the legal identification of belonging to one (or more) political, ethnic or linguistic groups
notation: REO10
preferred label: Nationality
related: E21 Person

REO11 Occupation
type: Class
color: #009E73
comment: This class comprises concepts denoted by terms from thesauri and controlled vocabularies used to characterize and classify the occupation of E21 Person at the moment of E7 Activity.
notation: REO11
preferred label: Occupation
related: E21 Person

REO13 Position
type: Class
color: #E69F00
comment: This class comprises concepts denoted by terms used to characterize and classify the physical position or posture of E21 Person during E7 Activity.
subclass of: E55 Type
subclass of: REO1 Circumstances
notation: REO13
preferred label: Position
related: E7 Activity

REO14 Provenance
type: Class
color: #56B4E9
comment: This class comprises concepts denoted by terms used to characterize and classify informations about how E21 Person obtained F5 Item.
subclass of: F5 Item
notation: REO14
preferred label: Provenance
related: F2 Expression

REO15 Religion (temporal entity)
type: Class
color: #009E73
comment: This class comprises concepts denoted by terms from thesauri and controlled vocabularies used to characterize and classify the religion of E21 Person at the moment of E7 Activity or at a given time.
notation: REO15
preferred label: Religion
related: E21 Person

REO16 Status
type: Class
color: #56B4E9
comment: This class comprises concepts denoted by terms used to characterize and classify the publication status of the F2 Expression.
subclass of: E55 Type
notation: REO16
preferred label: Status
related: F2 Expression

REO17 Habit
type: Class
color: #E69F00
comment: This class comprises the terms used to characterize a regular, habitual or inferquent practice of E7 Activity.
subclass of: REO2 Disposition
notation: REO17
preferred label: Habit
related: E7 Activity

REO18 Aim
type: Class
color: #E69F00
comment: The stated aim, objective, motivation or intention behind the reading.
subclass of: REO2 Disposition
notation: REO18
preferred label: Aim
related: E7 Activity

REO19 Skill
type: Class
color: #009E73
comment: This class comprises the terms or concepts used to characterize the level or capacity of performing E7 Activity, based on practical knowledge or know-how, and strategies, as well as trained through practice. Can be about the aptitude to understand immaterial notions, to make inferences, to create mental imagery based on E7 Activity, to act or communicate relevantly about F2 Expression
notation: REO19
preferred label: Reading Ability
related: E21 Person

REO20 Understanding
type: Class
color: #CC79A7
comment: This class comprises the terms or concepts used to characterize the general comprehension, awareness or knowledge resulting from E7 Activity or about E7 Activity itself.
notation: REO20
preferred label: Understanding
related: REO23 Effects (internal processes)

REO21 Emotions
type: Class
color: #CC79A7
comment: This class comprises the terms or concepts used to characterize the affective response (sentiment, appraisal, feeling) associated with E7 Activity
notation: REO21
preferred label: Emotions
related: REO23 Effects (internal processes)

REO22 Evaluation
type: Class
color: #F0E442
comment: Evaluative report of F2 Expression
notation: REO22
preferred label: Evaluation
related: REO12_Outcomes (external processes)

REO26 Summary
type: Class
color: #F0E442
comment: Non-evaluative report of a F2 Expression
notation: REO26
preferred label: Summary
related: REO12_Outcomes (external processes)

REO27 Mental imagery
type: Class
color: #CC79A7
comment: A sensory perception and representation enhanced by F2 Expression
notation: REO27
preferred label: Mental Imagery
related: REO23 Effects (internal processes)

REO28 Memories (textual)
type: Class
color: #CC79A7
comment: the act of remembering, or the thing remembered : memory, remembrance, recollection, reminiscence of something previously done
notation: REO28
preferred label: Memories (of reading)
related: REO23 Effects (internal processes)

REO29 Memories (non textual)
type: Class
color: #CC79A7
comment: the act of remembering, or the thing remembered: memory, remembrance, recollection, reminiscence of an event, idea, notion
notation: REO29
preferred label: Memories (other)
related: REO23 Effects (internal processes)

REO3 Environment
type: Class
color: #E69F00
comment: This class comprises concepts denoted by terms used to characterize and classify the environmental conditions under which E7 Activity took place.
subclass of: REO1 Circumstances
notation: REO3
preferred label: Environment
related: E7 Activity

REO31 Action
type: Class
color: #F0E442
comment: Activity of a result of E7 activity
notation: REO31
preferred label: Action
related: REO12_Outcomes (external processes)

REO32 Change in thinking
type: Class
color: #F0E442
comment: Where E7 Activity has caused a change in thinking
notation: REO32
preferred label: Change in Thinking
related: REO12_Outcomes (external processes)

REO33 Output
type: Class
color: #F0E442
comment: Produced as an intentional result of E7 Activity.
notation: REO33
preferred label: Output
related: REO12_Outcomes (external processes)

REO35 Age (temporal entity)
type: Class
color: #009E73
comment: Indication of age at the time of E7 Activity or at the time of report/testimonyof E7 Activity
notation: REO35
preferred label: Age
related: E21 Person

REO36 Citizenship
type: Class
color: #009E73
comment: This class comprises the concepts and terms used to characterize the legal status of being (a) a citizen of one (or more) independent states or (b) being a subject of one (or more) imperial systems.
subclass of: E55 Type
notation: REO36
preferred label: Citizenship
related: E21 Person

REO37 Linguistic communities
type: Class
color: #009E73
comment: This class comprises the concepts and terms used to characterize the identification with one or more than one distinct linguistic community
notation: REO37
preferred label: Linguistic Communities
related: E21 Person

RE038 Ethnic communities
type: Class
color: #009E73
comment: This class comprises the concepts and terms used to characterize the identification with one or (more than one) distinct ethnic community.
notation: REO38
preferred label: Ethnic Communities
related: E21 Person

REO39 Educational level
type: Class
color: #009E73
comment: This class comprises the terms and concepts used to characterize the level of education of the E21 Person at the time of E7 Activity, if known. Disctint from C21 Skill.
notation: REO39
preferred label: Educational Level
related: E21 Person

REO4 Frequency
type: Class
color: #E69F00
comment: This class comprises concepts denoted by terms used to characterize and classify the frequency of E7 Activity registered by E21 Person.
notation: REO4
preferred label: Frequency
related: E7 Activity

REO40 Subject matter
type: Class
color: #56B4E9
comment: This class comprises the concepts and terms used to characterize any information about the content or subject matter of the F2 Expression being read.
notation: REO40
preferred label: Subject Matter
related: F2 Expression

REO41 Medium
type: Class
color: #56B4E9
comment: This class comprises the concepts and terms used to characterize the medium (physical or digital) by which F2 Expression is communicated to E21 Person. The medium (physical or digital) by which the audio recording of a text is communicated to its listener(s).
subclass of: F5 Item
notation: REO41
preferred label: Medium
related: F2 Expression

REO42 Effects/Outcomes
type: Class
color: #CC79A7
comment: Placeholder class for existing annotations made using the READ-IT skinny ontology. They should be converted to instances of either REO12 or REO23.
subclass of: E7 Activity
deprecated: true
notation: REO42
preferred label: Effects/Outcomes

REO43 Appellation (temporal entity)
type: Class
color: #009E73
comment: This class refers to the fact that a E21 Person is identified by a group using a specific appellation during a given time span.
notation: REO43
preferred label: Name
related: E21 Person

REO44 RA vocabularies
type: Class
color: #56B4E9
comment: This class comprises concepts denoted by terms from existing thesauri and controlled vocabularies used to characterize and classify the content of the F2 Expression.
subclass of: E55 Type
notation: REO44
preferred label: Story element
related: F2 Expression

REO45 Discovery
type: Class
color: #56B4E9
comment: This class comprises concepts denoted by terms not included in existing thesauri or controlled vocabularies used to characterize and classify the content of the F2 Expression.
subclass of: E55 Type
notation: REO45
preferred label: Discovery
related: F2 Expression

REO5 Gender
type: Class
color: #009E73
comment: This class comprises concepts denoted by terms from thesauri and controlled vocabularies used to characterize and classify the gender of E21 Person at the moment of E7 Activity.
notation: REO5
preferred label: Gender
related: E21 Person

REO6 Genre
type: Class
color: #56B4E9
comment: This class comprises concepts denoted by terms from thesauri and controlled vocabularies used to characterize and classify the literary genre of the F2 Expression.
subclass of: E55 Type
notation: REO6
preferred label: Genre
related: F2 Expression

REO7 Intensity
type: Class
color: #E69F00
comment: This class comprises concepts denoted by terms used to characterize and classify the level of mental engagement and concentration of E21 Person during E7 Activity.
notation: REO7
preferred label: Intensity
related: E7 Activity

REO8 Lighting
type: Class
color: #E69F00
comment: This class comprises concepts denoted by terms used to characterize and classify the details of the lighting conditions under which E7 Activity took place.
subclass of: E55 Type
subclass of: REO1 Circumstances
notation: REO8
preferred label: Lighting
related: E7 Activity

REO9 Location
type: Class
color: #E69F00
comment: This class comprises concepts denoted by terms used to characterize and classify the location within a specific address (or mode of transport) where E7 Activity took place.
subclass of: E55 Type
subclass of: REO1 Circumstances
notation: REO9
preferred label: Location
related: E7 Activity

E53 Place
type: Class
color: #E69F00
notation: E53
preferred label: Place
related: E7 Activity

F5 Item
type: Class
comment: This class comprises physical objects (printed books, scores, CDs, DVDs, CD-ROMS, etc.) that carry a F24 Publication Expression and were produced by an industrial process involving an F3 Manifestation Product Type.
subclass of: E84 Information Carrier
notation: F5
preferred label: Item

E55 Type
type: Class
comment: This class comprises concepts denoted by terms from thesauri and controlled vocabularies used to characterize and classify instances of CRM classes. Instances of E55 Type represent concepts in contrast to instances of E41 Appellation which are used to name instances of CRM classes. E55 Type is the CRM’s interface to domain specific ontologies and thesauri. These can be represented in the CRM as subclasses of E55 Type, forming hierarchies of terms, i.e. instances of E55 Type linked via P127 has broader term (has narrower term). Such hierarchies may be extended with additional properties.
notation: E55
preferred label: Type

REO1 Circumstances
type: Class
comment: This class comprises concepts denoted by terms from thesauri and controlled vocabularies used to characterize and classify the circumstances of E7 Activity.
subclass of: E55
subclass of: E7 Activity
notation: REO1
preferred label: Circumstances

REO2 Disposition
type: Class
color: #009E73
comment: This class comprises the dispositions of an act of reading from the E39 Actor or E21 Person perspective. Premises are considered as the set of personal immaterial dispositions (motivation, inspiration, constraint ...) that lead to the realization of an E7 activity they precede. There may be one or more premises.
notation: REO2
preferred label: Disposition
related: E21 Person

REO12_Outcomes (external processes)
type: Class
color: #F0E442
comment: This class comprises the outcome of an action from the E39 Actor or E21 Person perspective. The outcome is considered direct effect or consequence resulting from E7 Activity which it follows. Outcome is considered immaterial as it mainly affects the state of mind and the condition of the E39 Actor or E21 Person. Outcome is not only consisting in a change of the state of mind but also in a change of the situation of the E39 Actor or E21 Person. There may be one or many outcomes resulting from E7 Activity.
subclass of: E7 Activity
subclass of: REO42 Effects/Outcomes
disjoint with: REO23 Effects (internal processes)
notation: REO12
preferred label: Outcomes (external processes)

REO23 Effects (internal processes)
type: Class
color: #CC79A7
comment: This class comprises the concepts and terms used to characterize the emotional, intellectual, or psychological effect that the E7 Activity has on the E21 Person at the time of E7 Activity.
subclass of: E7 Activity
subclass of: REO42 Effects/Outcomes
notation: REO23
preferred label: Effects (internal processes)

F2 Expression
type: Class
color: #56B4E9
comment: This class comprises the intellectual or artistic realisations of works in the form of identifiable immaterial objects, such as texts, poems, jokes, musical or choreographic notations, movement pattern, sound pattern, images, multimedia objects, or any combination of such forms that have objectively recognisable structures. The substance of F2 Expression is signs. Expressions cannot exist without a physical carrier, but do not depend on a specific physical carrier and can exist on one or more carriers simultaneously. Carriers may include human memory. Inasmuch as the form of F2 Expression is an inherent characteristic of the F2 Expression, any change in form (e.g., from alpha-numeric notation to spoken word, a poem created in capitals and rendered in lower case) is a new F2 Expression. Similarly, changes in the intellectual conventions or instruments that are employed to express a work (e.g., translation from one language to another) result in the creation of a new F2 Expression. Thus, if a text is revised or modified, the resulting F2 Expression is considered to be a new F2 Expression. Minor changes, such as corrections of spelling and punctuation, etc., are normally considered variations within the same F2 Expression. On a practical level, the degree to which distinctions are made between variant expressions of a work will depend to some extent on the nature of the F1 Work itself, and on the anticipated needs of users. The genre of the work may provide an indication of which features are essential to the expression. In some cases, aspects of physical form, such as typeface and page layout, are not integral to the intellectual or artistic realisation of the work as such, and therefore are not distinctive criteria for the respective expressions. For another work, features such as layout may be essential. For instance, the author or a graphic designer may wrap a poem around an image. An expression of a work may include expressions of other works within it. For instan…
subclass of: E89 Propositional Object
notation: F2
preferred label: Resource

E7 Activity
type: Class
color: #E69F00
notation: E7
preferred label: Act of Reading

E21 Person
type: Class
color: #009E73
notation: E21
preferred label: Reader